make[4]: Entering directory '/build/lede-17.01/slaves/phase2/arc_arc700/build/sdk/build_dir/target-arc_arc700_uClibc-1.0.14/ustream-ssl-cyassl/ustream-ssl-2018-05-22-5322f9db'
make[5]: Entering directory '/build/lede-17.01/slaves/phase2/arc_arc700/build/sdk/build_dir/target-arc_arc700_uClibc-1.0.14/ustream-ssl-cyassl/ustream-ssl-2018-05-22-5322f9db'
make[6]: Entering directory '/build/lede-17.01/slaves/phase2/arc_arc700/build/sdk/build_dir/target-arc_arc700_uClibc-1.0.14/ustream-ssl-cyassl/ustream-ssl-2018-05-22-5322f9db'
make[6]: Leaving directory '/build/lede-17.01/slaves/phase2/arc_arc700/build/sdk/build_dir/target-arc_arc700_uClibc-1.0.14/ustream-ssl-cyassl/ustream-ssl-2018-05-22-5322f9db'
make[6]: Entering directory '/build/lede-17.01/slaves/phase2/arc_arc700/build/sdk/build_dir/target-arc_arc700_uClibc-1.0.14/ustream-ssl-cyassl/ustream-ssl-2018-05-22-5322f9db'
[ 12%] Building C object CMakeFiles/ustream-ssl.dir/ustream-ssl.c.o
In file included from /build/lede-17.01/slaves/phase2/arc_arc700/build/sdk/build_dir/target-arc_arc700_uClibc-1.0.14/ustream-ssl-cyassl/ustream-ssl-2018-05-22-5322f9db/ustream-ssl.c:25:0:
/build/lede-17.01/slaves/phase2/arc_arc700/build/sdk/build_dir/target-arc_arc700_uClibc-1.0.14/ustream-ssl-cyassl/ustream-ssl-2018-05-22-5322f9db/ustream-internal.h:28:29: fatal error: wolfssl/options.h: No such file or directory
 #include <wolfssl/options.h>
                             ^
compilation terminated.
CMakeFiles/ustream-ssl.dir/build.make:62: recipe for target 'CMakeFiles/ustream-ssl.dir/ustream-ssl.c.o' failed
make[6]: *** [CMakeFiles/ustream-ssl.dir/ustream-ssl.c.o] Error 1
make[6]: Leaving directory '/build/lede-17.01/slaves/phase2/arc_arc700/build/sdk/build_dir/target-arc_arc700_uClibc-1.0.14/ustream-ssl-cyassl/ustream-ssl-2018-05-22-5322f9db'
CMakeFiles/Makefile2:141: recipe for target 'CMakeFiles/ustream-ssl.dir/all' failed
make[5]: *** [CMakeFiles/ustream-ssl.dir/all] Error 2
make[5]: Leaving directory '/build/lede-17.01/slaves/phase2/arc_arc700/build/sdk/build_dir/target-arc_arc700_uClibc-1.0.14/ustream-ssl-cyassl/ustream-ssl-2018-05-22-5322f9db'
Makefile:127: recipe for target 'all' failed
make[4]: *** [all] Error 2
make[4]: Leaving directory '/build/lede-17.01/slaves/phase2/arc_arc700/build/sdk/build_dir/target-arc_arc700_uClibc-1.0.14/ustream-ssl-cyassl/ustream-ssl-2018-05-22-5322f9db'
Makefile:70: recipe for target '/build/lede-17.01/slaves/phase2/arc_arc700/build/sdk/build_dir/target-arc_arc700_uClibc-1.0.14/ustream-ssl-cyassl/ustream-ssl-2018-05-22-5322f9db/.built' failed
make[3]: *** [/build/lede-17.01/slaves/phase2/arc_arc700/build/sdk/build_dir/target-arc_arc700_uClibc-1.0.14/ustream-ssl-cyassl/ustream-ssl-2018-05-22-5322f9db/.built] Error 2